C++ Syntax Error Identifier

This is the code, i used the example from MSDN, my skills in C++. (88) : error C2065: ‘m_listbox_hwnd’ : undeclared identifier j:browse-source.cpp(90) : error C2065: ‘and’ : undeclared identifier.

Lecture Hall Bloodborne Lore In Hanley’s lecture hall, a “microcosm of pro-Patriot and anti-Patriot feelings. Beloved in the Bronx but hated just about everywhere else, the team cemented itself in pop culture lore by winning. #bloodborne#the old hunters#hunter's nightmare#research hall#m.e:bb. Favourite areas in Bloodborne – Fishing Hamlet. (creator of the "paleblood hunt" , comprehensive lore book on bloodborne) said

syntax error : missing ‘;’ before identifier ‘get_end’ C:Documents and SettingsKulotskiDesktopch7prob4ch7prob4.cpp(19) : fatal error C1004: unexpected end of file found Error executing cl.exe.

Oct 29, 2018  · Purpose of this document. If you are a C++ developer then you sometimes need to have a look at the C++ BNF grammar. At least I do. But reading a set of BNF rules is difficult since you have to jump from one rule to the next one, maybe pages away from it.

Mar 21, 2015  · I recently read that changing the name of the game causes it to no longer compile. A fix is being worked on for the next release of the demo. I will try and find the post where I read this to see if there is more info.

I have this C++ code : const int ANYSIZE. Help me please. Error 1 Syntax error, bad array declarator. To declare a managed array the rank specifier precedes the variable’s identifier. To declare a.

This content, along with any associated source code and files, is licensed under The Code Project Open License (CPOL)

syntax error : missing ‘;’ before ‘}’ c:documents and settingspetermy documentsc++hangmanhangmanhangmanmain.cpp(16) : error C2065: ‘clrscr’ : undeclared identifier c:documents and.

C++ does not support default-int e:code zonepractice codemy_first_classmatrix_classmatrix_classmatrix.h(8) : error C2062: type ‘int’ unexpected e:code zonepractice.

Your problem does not seem to be in the structure declaration, but rather where you try to use it. The code you showed does not hold any cfg identifier. Find this identifier in your code, you most likely forgot to terminate one of your statements with a semicolon.

C and C++ Language Syntax Reference Most of the notes in this reference conform to both C and C++. When a syntax distinction between C and C++ exists, it is explicitly noted. Some elements are listed under multiple categories, in which case all but the primary reference have listed with an @ sign.

Hi, i’m doing a small program that communicates with my first SQL Server, but I’m having some troubles with the C++ (I’m usued to C only. db lasttest form db lastmydb.h(29) : error C2061: syntax.

when i run my code, i get lots of undefined class errors, even though i have defined. visual studio 2008projectsengineengineglobals.h(14) : error C2146: syntax error : missing ‘;’ before.

Jun 27, 2008  · Pixel.to.life wrote: Thanks Ben. I tried that, now it compiled file. But the memory address of the original image and the one I receive inside ChangeImage(.) is still

"The solutions and answers provided on Experts Exchange have been extremely helpful to me over the last few years. I wear a lot of hats – Developer, Database Administrator, Help Desk, etc., so I know a lot of things but not a lot about one thing.

syntax error : missing ‘;’ before ‘{‘ 1>c:documents and settingsuserdesktopc++ programmingmidterm2invoicemidterm2invoicemidterm2_invoice.cpp(68) : error C3861: ‘While’: identifier not found".

Developer Community for Visual Studio Product family. Attachments: Up to 5 attachments (including images) can be used with a maximum of 2.1 GB each and 2.1 GB total.

syntax error : missing ‘;’ before ‘type’ c:usersdsudropboxcodescgamereedtuckercommands.c(28): error C2065: ‘done’ : undeclared identifier.

Mar 21, 2015  · I recently read that changing the name of the game causes it to no longer compile. A fix is being worked on for the next release of the demo. I will try and find the post where I read this to see if there is more info.

Are you using a C compiler, or a C++ compiler. sortingXsortingX.c(11): error #2001: Syntax error: expected ‘;’ but found ‘&’. C:UsersadakDocumentsPelles C ProjectssortingXsortingX.c(11):.

Once again you need to read the documentation for the functions you are trying to use, rather than guessing at the parameters. You are using the addressof operator on your array names in your scanf statements, which is wrong. You also need to specify the buffer lengths when using the <code_s< code=""> variant of these functions.

Auto-suggest helps you quickly narrow down your search results by suggesting possible matches as you type.

Note: C++ does not support default-int bstree.cpp 50 Error 3 error C2065: ‘DataType’ : undeclared identifier bstree.cpp 50 Error 4 error C2065: ‘KeyType’ : undeclared identifier bstree.cpp 50 Error.

#include <iostream> // standard IO routines #include <iomanip> // for output formatting #include <fstream> // standard file stream #include <cmath> // standard math functions #include <string> //.

Sorry for not noting that right away, but that source snippet is pseudocode and is just meant to illustrate the concept. Just look at the lines 15 and 19, neither ‘reference’ nor ‘pointer’ are valid keywords in C++.

Nov 19, 2008  · Need help? Post your question and get tips & solutions from a community of 424,988 IT Pros & Developers. It’s quick & easy.

Note: C++ does not support default-int 1>c:userszvjezdandocumentsvisual studio 2010projectsweek5_mathweek5_mathprogram.cpp(129): error C2143: syntax error : missing. a’ : undeclared.

Research Papers On Steganography University Of Maryland Academic Calendar 2019 Academic Calendar. The Academic. Summer 2019. No classes on. A University System of Maryland Member Institution Sign Up For Text Alerts Accessibility Emergency. Consult the individual department or program for the appropriate calendar to use. For current year academic. 2019 Academic Year (Current) 2019. University. Convention Center Thesis Pdf

but i get the following error e:program filesmicrosoft visual studiovc98includelt360lib.h(182) : error C2146: syntax error : missing ‘;’ before identifier ‘LT360LIB_LinkedCnt. Please note i.

I am new in C++. identifier 1>c:usersmmddocumentsvisual studio 2010projects888888mynewheader.h(6): error C2065: ‘form1’ : undeclared identifier 1>c:usersmmddocumentsvisual studio.

C++ tutorial: C++ questions and answers about C++ language basic syntax Part II. Test your knowledge of C++ language basic syntax.

Oct 11, 2018  · Developer Community for Visual Studio Product family. Get help from our community supported forum

error C2146: syntax error : missing ‘;’ before identifier ‘ip error C4430: missing type specifier – int assumed. Note: C++ does not support default-int error C4430: missing type specifier – int.

You need to pay attention to your semi-colon use. See the in-code comment I added. The particular semi-colon you missed is a huge one. If that one is missing the compiler will get VERY confused.

Which Philosopher Referred To Human Beings As The Social Animal? University Of Maryland Academic Calendar 2019 Academic Calendar. The Academic. Summer 2019. No classes on. A University System of Maryland Member Institution Sign Up For Text Alerts Accessibility Emergency. Consult the individual department or program for the appropriate calendar to use. For current year academic. 2019 Academic Year (Current) 2019. University. Convention Center Thesis Pdf
Biggest Lecture Hall At Umich Speaking to a lecture hall packed with a diverse audience of all ages. Fonda, 79, and Tomlin, 78, addressed the topic at Kalamazoo College on Tuesday and will stop at the University of Michigan’s. Which Philosopher Referred To Human Beings As The Social Animal? University Of Maryland Academic Calendar 2019 Academic Calendar. The Academic. Summer

Could you please post some code especially the function declarations in derived class and making the objects and calling functions Tag: Visual C++ Language syntax error: identifier ‘{ctor}’ Visual C++; 2. VS.Net 2005, how to disable intellisense.

Here are my errors: source1.cpp(28) : error C4430: missing type specifier – int assumed. Note: C++ does not support default. SavingsAccount’ : undeclared identifier source1.cpp(103) : error C2146:.