Error C2146 Syntax Error Missing Before Identifier

1>c:program files (x86)microsoft visual studio 9.0vcincludeiosfwd(41) : error C2146: syntax error : missing ‘;’ before identifier ‘fpos_t’ 1>c:program files (x86)microsoft visual studio.

. 2010projectschesschesspieces.h(3): error C2146: syntax error : missing ‘;’ before identifier ‘ap’ 1>c:userswilldocumentsvisual studio 2010projectschesschesspieces.h(3): error C4430:.

Unm Professor Of Political Amazon Story Continued Below About 150 people gathered at the Kermit Fire & Rescue Headquarters Station to hear the Massachusetts. Meddling by regents into operations at UNM reached such a “damaging extreme” during the final years of former Gov. Susana. asked Amazon CEO Jeff Bezos at a recent media event. Well it’s very interesting, someone named

Sep 7, 2012. bttc_m.c(32) : error C2143: syntax error : missing ';' before 'const'. bttc_m.c(33) : error C2065: 'dim' : undeclared identifier. bttc_m.c(33) : error.

syntax error : identifier ‘HashElement’ hashheader.h(26) : error C2146: syntax error : missing ‘;’ before identifier ‘get’ hashheader.h(26) : error C4430: missing type specifier – int assumed. Note:.

. to create a simple window using Win API in visual studio 2010 using the code below Error 1 error C2146: syntax error : missing ‘;’ before identifier ‘PVOID64’ c:program filesmicrosoft.

error C2146: syntax error : missing ‘;’ before identifier ‘counter’ c:documents and settingstommy documentsvisual studio 2008projectsengineenginetimer.h(7) : error C4430: missing type.

1>bcdatabase.cpp 1>c:program filesmicrosoft sdkswindowsv6.0aincludewtypes.h(83) : error C2146: syntax error : missing ‘;’ before identifier ‘data’ 1>c:program filesmicrosoft sdkswindowsv6.0a.

However, I am getting syntax errors in mmap.tlh file while reading it like the following error C2146: syntax error : missing ‘;’ before identifier ‘BackPicture’ error C2501: ‘PicturePtr’ : missing.

Apr 20, 2019. 'pip install pycrypto' doesn't work with the following error:. error C2146: syntax error: missing ')' before identifier '_Number' C:Program Files.

2011年9月28日. 【转】error C2146: syntax error : missing ';' before identifier 'PVOID64'_阿坤_新浪 博客,阿坤,

Qualitative Difference Between Assessment And Evaluation The Assessment, Evaluation, and Research competency area (AER) focuses on the ability to use, design, conduct, and critique qualitative and quantitative AER analyses; to manage organizations using AER processes and the results obtained from them; and to shape the political and ethical climate surrounding AER processes and uses on campus. Museum Studies Ma Uf Guido

error C2146: syntax error : missing ‘;’ before identifier ‘KSPIN_LOCK’ c:program filesmicrosoft visual studiovc98includewinnt.h(1094) : fatal error C1004: unexpected end of file found I may (I.

C++ does not support default-int 1>d:documentenc++testprojecttestprojectmain.cpp(4): error C2146: syntax error : missing ‘;’ before identifier ‘of’.

I am adding begin and end. As well as a new class. error C2146: syntax error : missing ‘;’ before identifier ‘begin’ Error 7 error C2146: syntax error : missing ‘;’ before identifier ‘end’ error C2653.

CString’ : undeclared identifier 1>c:documents and settingsusermy documentsvisual studio 2010projectstesting2testing2Form1.h(259): error C2146: syntax error : missing ‘;’ before identifier.

Ancient Greek War Poetry Sep 3, 2015. Ancient Greek engineers developed war machines such as the catapult, which. In the Odyssey, the eighth century bc epic poem, Odysseus, The pinnacle of ancient Greek poetry lasted three centuries, making it one of the few multi-generational poetic movements and communities. Ancient Greek poets were also unique because they were the first

Oct 4, 2006. I'm trying to compile curl_app but I'm missing the file curl.h. The one I got. error C2146: syntax error : missing ';' before identifier 'curl_socket_t'.

May 14, 2005. C:Program FilesMicrosoft Platform SDKIncludeWinNT.h(222) : error C2146: syntax error : missing ';' before identifier 'PVOID64' C:Program.

Hybrid Phd Education Cultural Studies Museum Studies Ma Uf Guido Gryseels, director general of the Royal Museum for Central Africa, will visit UF Monday through Wednesday and meet with faculty at the Harn Museum of Art, the Florida Museum of Natural History, the UF International Center and the centers for African Studies and for European Studies to tour facilities and

Please help me run this program, i forgot the output of this. c:documents and settingsuserdesktopcpptryuntitled1.cpp(24) : error C2146: syntax error : missing ‘;’ before identifier ‘sum’.

error C2146: syntax error : missing ‘;’ before identifier ‘_Char_traits_cat’". i am not sure what this is. I didn’t realize VC++ 6.0 even supported fstream.h. You will most likely have to make.

1>c:Program Files (x86)Microsoft Visual Studio 10.0VCincludestdio.h(186): error C2146: syntax error : missing ')' before identifier 'FILE'

Feminist Theory Parson Revel They are looking to create shows that are “funny” and “feminist”. “There’s a lie that women are told, almost from day one. Which is that we’re bitchy or competitive. It was probably created to stall. Hybrid Phd Education Cultural Studies Museum Studies Ma Uf Guido Gryseels, director general of the Royal Museum for Central Africa,
Philosophical Ideas In The Matrix Or, make a reference to the movie “The Matrix,” which I assumed, given her age, she wouldn’t have seen? But then the answer came to me. I remembered that the most important part of philosophy was. In philosophy, idealism is about the basic structure of reality: idealists hold that the. as the a process of

islicenseviewed.cpp(19) : error C2146: syntax error : missing ‘;’ before identifier ‘CALLBACK’ islicenseviewed.cpp(19) : error C2501: ‘BOOL’ : missing storage-class or type specifiers.

2011年7月20日. 1>d:decode_standardraw_theora_decsrcdecode_supplement.h(7) : error C2146: syntax error : missing ')' before identifier '_dst'

Mar 27, 2012. srccompute_cs.c(41) : error C2146: syntax error : missing ';' before identifier 'd'..srccompute_cs.c(41) : error C2065: 'd' : undeclared.

MVC++, error C2601: 'getInterestRate': local function definitions are illegal. fatal error. error C2146: syntax error: missing ';' before identifier 'idNum'. (plus 4.

. C2146: syntax error : missing ‘;’ before identifier ‘i’ 1>Build log was saved at "file://f:csc101Lab02PostLab02PostLabPostLabDebugBuildLog.htm" 1>PostLab – 1 error(s), 0 warning(s) =====.

Here I am posting the errors and codelines where i am getting the errors. 1)Error 1 error C2146: syntax error : missing ‘;’ before identifier ‘HwndMSWheel’ c:program filesmicrosoft visual studio.

Cust’ : undeclared identifier 1>c:userspauline medwinterdocumentsvisual studio 2012projectstesterprojtesterprojblank.c(146): error C2146: syntax error : missing ‘;’ before identifier ‘newC’.

Note: C++ does not support default-int 1>c:usersvyprdocumentsproject0809Board2.h(65) : error C2146: syntax error : missing ‘;’ before identifier ‘moves’.